{"text_format":"1","workbook":"xlsx","n_sheets":6,"sheets":["How to use this Spreadsheet","Cougar SV Rear Geometry","Roll Centre Positions","Roll Centre Comparisons","Lookup Tables","Stored data"],"not_rendered":{"charts":13,"images":0,"macros":1,"external_links":0,"defined_names":75,"comments":0,"pivot_tables":0},"unopened":[],"bounds":{"document_bytes":16777216,"sheet_cells":100000,"rows_first":2000,"rows_last":500,"rows_between":2000,"halvings":0,"cell_chars":16384,"cell_head_chars":4096},"cells_cut":0,"cells_raw":0,"read":"whole","date_system":"1900"}

{"sheet":"How to use this Spreadsheet","index":0,"n_rows":22,"n_cols":2,"rows_kept":22,"cut":false,"hidden":false,"merged":[]}
[]
[null,"In general, anything with a light blue background (matching this cell) is for user input."]
[]
[null,"The first sheet \"Cougar SV Rear Geometry\" allows the user to input a car setup, then set the ride height and roll angle to see the shape of the rear suspension."]
[null,"Camber angles for each wheel are plotted, as well as left & right instant centres, and the roll centre."]
[null,"The diagram updates automatically each time any blue cell is changed."]
[]
[]
[null,"The second sheet \"Roll Centre Comparisons\" alows the user to input two different setups and compare the camber and roll centre for a complete range of ride heights and roll angles."]
[null,"Up to six setups can be stored in positions 1-6 for easy retrieval. Use the load and store functions to move the setup between the stored positions and the main sheet"]
[null,"The names of the stored setups can be customised as required."]
[]
[null,"\"Adjust upper wishbone to set camber\" can be used to set both setups to have the same static camber."]
[]
[null,"The calculation is run only when the large blue button is pressed to \"Calculate Geometries\""]
{"$rows_left_out":8}
{"sheet":"Cougar SV Rear Geometry","index":1,"n_rows":65,"n_cols":14,"rows_kept":65,"cut":false,"hidden":false,"merged":[[2,1,2,5],[2,8,2,12],[1,1,1,13],[41,1,41,3],[41,8,41,10],[41,5,41,6],[34,1,34,3],[34,8,34,10],[22,12,22,13],[12,1,12,13],[21,1,21,13],[13,12,13,13],[13,5,13,6],[22,5,22,6],[4,1,4,13],[40,1,40,13],[10,8,10,12],[9,8,9,12],[8,8,8,12],[3,1,3,5],[5,8,5,12],[10,1,10,5],[6,8,6,12],[5,1,5,5],[6,1,6,5],[7,1,7,5],[7,8,7,12],[8,1,8,5],[9,1,9,5]]}
[]
[null,"Instant Position"]
[null,"Body Roll Angle (Deg)",null,null,null,null,0,null,"Body Ride Height (mm)",null,null,null,null,15]
[]
[null,"Car Specification"]
[null,{"$f":"'Lookup Tables'!B3","v":"Lower Gearbox Housings"},null,null,null,null,"Std",null,{"$f":"'Lookup Tables'!B9","v":"Upper Link"},null,null,null,null,34]
[null,{"$f":"'Lookup Tables'!B4","v":"Antisquat Spacers"},null,null,null,null,0,null,{"$f":"'Lookup Tables'!B10","v":"Upper Link Spacers"},null,null,null,null,6]
[null,{"$f":"'Lookup Tables'!B5","v":"Rear Toe Block"},null,null,null,null,3,null,{"$f":"'Lookup Tables'!B11","v":"Upper Ball Stud Spacers"},null,null,null,null,0]
[null,{"$f":"'Lookup Tables'!B6","v":"Rear Hubs"},null,null,null,null,"Std",null,{"$f":"'Lookup Tables'!B12","v":"Lower Wishbones"},null,null,null,null,"Std"]
[null,{"$f":"'Lookup Tables'!B7","v":"Rear Hub Hole Pos."},null,null,null,null,"Centre",null,{"$f":"'Lookup Tables'!B13","v":"Upper Wishbones"},null,null,null,null,69.5]
[null,{"$f":"'Lookup Tables'!B8","v":"Rear Track"},null,null,null,null,"Wide",null,{"$f":"'Lookup Tables'!B14","v":"Tyres"},null,null,null,null,"Minispike"]
[]
[null,"Geometry"]
[null,"LH","X","Y",null,"Lengths",null,null,"RH","X","Y",null,"Lengths"]
[null,"A",{"$f":"(0-(SQRT((0-(-((VLOOKUP(G6,'Lookup Tables'!B17:D17,3)/2)+(VLOOKUP(G8,'Lookup Tables'!Rear_toe_block,2)/2))/2))^2 + (((((9+(5+G7))/2)+(30.5 + (N7-N8)*COS(RADIANS(20))))/2)-((9+(5+G7))/2))^2))*SIN((ATAN((0-(-((VLOOKUP(G6,'Lookup Tables'!B17:D17,3)/2)+(VLOOKUP(G8,'Lookup Tables'!Rear_toe_block,2)/2))/2))/((((((9+(5+G7))/2)+(30.5 + (N7-N8)*COS(RADIANS(20))))/2)+Ride_Height)-(((9+(5+G7))/2)+Ride_Height))))-RADIANS(Roll_Angle)))","v":-17},{"$f":"((((((9+(5+G7))/2)+(30.5 + (N7-N8)*COS(RADIANS(20))))/2)+Ride_Height)-(SQRT((0-(-((VLOOKUP(G6,'Lookup Tables'!B17:D17,3)/2)+(VLOOKUP(G8,'Lookup Tables'!Rear_toe_block,2)/2))/2))^2 + (((((9+(5+G7))/2)+(30.5 + (N7-N8)*COS(RADIANS(20))))/2)-((9+(5+G7))/2))^2))*COS((ATAN((0-(-((VLOOKUP(G6,'Lookup Tables'!B17:D17,3)/2)+(VLOOKUP(G8,'Lookup Tables'!Rear_toe_block,2)/2))/2))/((((((9+(5+G7))/2)+(30.5 + (N7-N8)*COS(RADIANS(20))))/2)+Ride_Height)-(((9+(5+G7))/2)+Ride_Height))))-RADIANS(Roll_Angle)))","v":22},null,"AC",{"$f":"VLOOKUP(N9,'Lookup Tables'!Rear_Lower_Wishbone,2,FALSE)","v":74},null,"Z",{"$f":"(0+(SQRT((0-(-((VLOOKUP(G6,'Lookup Tables'!B17:D17,3)/2)+(VLOOKUP(G8,'Lookup Tables'!Rear_toe_block,2)/2))/2))^2 + (((((9+(5+G7))/2)+(30.5 + (N7-N8)*COS(RADIANS(20))))/2)-((9+(5+G7))/2))^2))*SIN((ATAN((0-(-((VLOOKUP(G6,'Lookup Tables'!B17:D17,3)/2)+(VLOOKUP(G8,'Lookup Tables'!Rear_toe_block,2)/2))/2))/((((((9+(5+G7))/2)+(30.5 + (N7-N8)*COS(RADIANS(20))))/2)+Ride_Height)-(((9+(5+G7))/2)+Ride_Height))))+RADIANS(Roll_Angle)))","v":17},{"$f":"((((((9+(5+G7))/2)+(30.5 + (N7-N8)*COS(RADIANS(20))))/2)+Ride_Height)-(SQRT((0-(-((VLOOKUP(G6,'Lookup Tables'!B17:D17,3)/2)+(VLOOKUP(G8,'Lookup Tables'!Rear_toe_block,2)/2))/2))^2 + (((((9+(5+G7))/2)+(30.5 + (N7-N8)*COS(RADIANS(20))))/2)-((9+(5+G7))/2))^2))*COS((ATAN((0-(-((VLOOKUP(G6,'Lookup Tables'!B17:D17,3)/2)+(VLOOKUP(G8,'Lookup Tables'!Rear_toe_block,2)/2))/2))/((((((9+(5+G7))/2)+(30.5 + (N7-N8)*COS(RADIANS(20))))/2)+Ride_Height)-(((9+(5+G7))/2)+Ride_Height))))+RADIANS(Roll_Angle)))","v":22},null,"XZ",{"$f":"VLOOKUP(N9,'Lookup Tables'!Rear_Lower_Wishbone,2,FALSE)","v":74}]
{"$rows_left_out":51}
{"sheet":"Roll Centre Positions","index":2,"n_rows":99,"n_cols":16,"rows_kept":99,"cut":false,"hidden":true,"merged":[[30,1,50,1],[4,3,4,15],[4,1,5,2],[6,1,26,1],[28,1,29,2],[28,3,28,15],[78,1,98,1],[52,1,53,2],[52,3,52,15],[54,1,74,1],[76,1,77,2],[76,3,76,15]]}
[]
[]
[]
[]
[null,"Y Roll\nCentre",null,"Ride Height (mm)"]
[null,null,null,0,2,4,6,8,10,12,14,16,18,20,22,24]
[null,"Roll Angle (Deg)",0,41.55715611228743,38.045732168383736,34.703477896294658,31.509850327227646,28.448116152000647,25.504471091410647,22.668389228219432,19.930998303641456,17.285151495334617,14.725356560510583,12.247281739518399,9.847924958033369,7.5249197958742444]
[null,null,0.5,41.556138523396783,38.044289667271045,34.701790221571322,31.507960671261959,28.445966478709956,25.502244924422918,22.666048889634776,19.928389166421926,17.28231683563919,14.722345669418274,12.244003613237513,9.8443343095072517,7.5207705152952338]
[null,null,1,41.553138264291832,38.040283635505546,34.697031699131657,31.502391333373406,28.439768761985441,25.495583562160878,22.658695692835817,19.920498868371624,17.273959747796507,14.713314657232777,12.23425758694056,9.8334341558660014,7.5084088815616585]
[null,null,1.5,41.547928799009483,38.033486880690489,34.688925185161771,31.493219632092512,28.429479637108582,25.484259103623046,22.646478316613695,19.907410411899505,17.25992869438716,14.698160801159526,12.217873692554331,9.8153200029707826,7.4876804120181637]
[null,null,2,41.540721175480968,38.024082881222043,34.67762822252174,31.480151326391773,28.415024834901882,25.468465710014009,22.629485089882358,19.889239750463215,17.240289020764138,14.677068598083896,12.194892125375949,9.7899471997585579,7.4586870839518404]
[null,null,2.5,41.531519466374142,38.011949407897191,34.662995145871072,31.463502379219662,28.39644151908098,25.448296572310625,22.607556482046032,19.865580335424781,17.215051927320459,14.649907588980096,12.165497475645589,9.7574298105381168,7.421440944984707]
[null,null,3,41.520202527040318,37.997100458593891,34.645232883514545,31.443125299474012,28.373740538190624,25.423443929085092,22.580797524077436,19.836896254073267,17.184194355626296,14.616818524731213,12.12953251820165,9.7176961573262588,7.3760606550569863]
[null,null,3.5,41.506870656585193,37.979738367078845,34.624153518478543,31.419058880602485,28.346923078476685,25.394179886933088,22.549092238927038,19.802908122528287,17.147818890097572,14.577737423582443,12.087104360853921,9.6709141194583026,7.3224943403948322]
[null,null,4,41.491740265655352,37.959514345338249,34.599976136255229,31.391223604109207,28.316056340630041,25.360348751218901,22.512651934928005,19.763797458180335,17.105890508626931,14.532614576855144,12.038239282068309,9.6168645719228998,7.2607710982647387]
{"$rows_left_out":85}
{"sheet":"Roll Centre Comparisons","index":3,"n_rows":100,"n_cols":70,"rows_kept":100,"cut":false,"hidden":false,"merged":[[15,8,15,12],[9,1,9,5],[9,8,9,12],[10,1,10,5],[10,8,10,12],[18,1,18,5],[18,8,18,12],[12,1,12,13],[13,1,13,5],[13,8,13,12],[14,1,14,5],[14,8,14,12],[16,1,16,5],[16,8,16,12],[17,1,17,5],[17,8,17,12],[76,15,77,16],[76,17,76,29],[76,31,77,32],[76,33,76,45],[4,33,4,45],[6,31,26,31],[28,31,29,32],[28,33,28,45],[52,15,53,16],[52,17,52,29],[30,31,50,31],[4,15,5,16],[4,17,4,29],[6,15,26,15],[28,15,29,16],[28,17,28,29],[30,15,50,15],[4,31,5,32],[20,1,21,5],[20,6,21,6],[20,8,21,12],[78,15,98,15],[78,31,98,31],[54,15,74,15],[52,31,53,32],[53,1,54,5],[53,6,54,6],[25,8,25,9],[25,10,25,12],[26,8,26,9],[26,10,26,12],[27,8,27,9],[27,10,27,12],[22,8,22,9],[22,10,22,12],[23,8,23,9],[23,10,23,12],[24,8,24,9],[24,10,24,12],[26,3,26,5],[25,3,25,5],[24,3,24,5],[22,3,22,5],[26,6,27,6],[22,1,22,2],[23,1,23,2],[24,6,25,6],[22,6,23,6],[24,1,24,2],[25,1,25,2],[26,1,26,2],[55,1,55,2],[55,3,55,5],[56,1,56,2],[56,3,56,5],[57,1,57,2],[57,3,57,5],[27,1,27,2],[27,3,27,5],[23,3,23,5],[62,1,63,5],[62,6,63,6],[64,6,65,6],[58,1,58,2],[58,3,58,5],[59,1,59,2],[59,3,59,5],[60,1,60,2],[60,3,60,5],[67,1,67,2],[67,3,67,5],[68,1,68,2],[68,3,68,5],[69,1,69,2],[69,3,69,5],[66,6,67,6],[68,6,69,6],[64,1,64,2],[64,3,64,5],[65,1,65,2],[65,3,65,5],[66,1,66,2],[66,3,66,5],[67,8,67,9],[67,10,67,12],[68,8,68,9],[68,10,68,12],[69,8,69,9],[69,10,69,12],[66,13,67,13],[68,13,69,13],[64,8,64,9],[64,10,64,12],[65,8,65,9],[65,10,65,12],[66,8,66,9],[66,10,66,12],[64,13,65,13],[62,8,63,12],[62,13,63,13],[22,13,23,13],[24,13,25,13],[26,13,27,13],[55,13,56,13],[57,13,58,13],[59,13,60,13],[58,8,58,9],[58,10,58,12],[59,8,59,9],[59,10,59,12],[60,8,60,9],[60,10,60,12],[55,8,55,9],[55,10,55,12],[56,8,56,9],[56,10,56,12],[57,8,57,9],[57,10,57,12],[27,69,27,77],[1,1,1,3],[2,1,2,3],[27,47,27,54],[27,55,27,61],[27,63,27,68],[55,6,56,6],[57,6,58,6],[59,6,60,6],[20,13,21,13],[53,8,54,12],[53,13,54,13],[52,33,52,45],[54,31,74,31],[4,1,4,13],[5,1,5,5],[5,8,5,12],[6,1,6,5],[6,8,6,12],[7,1,7,5],[7,8,7,12],[8,1,8,5],[8,8,8,12],[15,1,15,5]]}
[" "]
[null,"Camber target",null,null,-1]
[null,"Ride height",null,null,15]
[]
[null,"Specification 1",null,null,null,null,null,null,null,null,null,null,null,null,null,"Y Roll Centre",null,"Ride Height (mm)",null,null,null,null,null,null,null,null,null,null,null,null,null,"Y Roll\nCentre",null,"Ride Height (mm)"]
[null,{"$f":"'Lookup Tables'!B3","v":"Lower Gearbox Housings"},null,null,null,null,"Std",null,{"$f":"'Lookup Tables'!B9","v":"Upper Link"},null,null,null,null,34,null,null,null,0,2,4,6,8,10,12,14,16,18,20,22,24,null,null,null,{"$f":"R6","v":0},{"$f":"S6","v":2},{"$f":"T6","v":4},{"$f":"U6","v":6},8,10,12,14,16,18,20,22,{"$f":"AD6","v":24}]
[null,{"$f":"'Lookup Tables'!B4","v":"Antisquat Spacers"},null,null,null,null,0,null,{"$f":"'Lookup Tables'!B10","v":"Upper Link Spacers"},null,null,null,null,6,null,"Roll Angle (Deg)",0,-39.517312810411298,-36.883921827068015,-34.260775666622621,-31.647049505754282,-29.041873082149429,-26.444946753484341,-23.855030115754762,-21.272070102195066,-18.695146368424293,-16.123764503535917,-13.557391186725972,-10.995375304058006,-8.4375668058346776,{"$f":"HLOOKUP($BR$28,R6:AD27,2)","v":-26.444946753484341},"Roll Angle (Deg)",{"$f":"Q7","v":0},-36.995188076029962,-34.613829159883032,-32.22539042074056,-29.831266273535267,-27.432748155586651,-25.030657562316105,-22.625988155011513,-20.219097819285775,-17.810827906587512,-15.4019146379059,-12.992552009851162,-10.583238876582286,-8.1747826822480256,{"$f":"HLOOKUP($BR$28,AH6:AT27,2)","v":-25.030657562316105}]
[null,{"$f":"'Lookup Tables'!B5","v":"Rear Toe Block"},null,null,null,null,3,null,{"$f":"'Lookup Tables'!B11","v":"Upper Ball Stud Spacers"},null,null,null,null,0,null,null,0.5,-39.132863193743596,-36.486721230236633,-33.852196187777025,-31.227950477674259,-28.61401052718584,-26.008850943053027,-23.411766044999975,-20.822720365646003,-18.240340246623042,-15.664437200406011,-13.094682144719435,-10.530054846774046,-7.9710680290080624,{"$f":"HLOOKUP($BR$28,R6:AD27,3)","v":-26.008850943053027},null,{"$f":"Q8","v":0.5},-36.821375760294032,-34.414751651058566,-32.003888456286035,-29.589712306408206,-27.173398053154788,-24.755485238034797,-22.336423457629426,-19.917313020887853,-17.49855205165111,-15.080407482305088,-12.66355481934224,-10.248561066215551,-7.8362337103949544,{"$f":"HLOOKUP($BR$28,AH6:AT27,3)","v":-24.755485238034797}]
[null,{"$f":"'Lookup Tables'!B6","v":"Rear Hubs"},null,null,null,null,"Std",null,{"$f":"'Lookup Tables'!B12","v":"Lower Wishbones"},null,null,null,null,"Std",null,null,1,-38.748675864096732,-36.090364450956265,-33.444825071385431,-30.811278004584846,-28.188765878265972,-25.576157026886854,-22.972988974391882,-20.378398215953496,-17.791796635687646,-15.212714281619075,-12.641002101008068,-10.076141295210499,-7.5195769963545649,{"$f":"HLOOKUP($BR$28,R6:AD27,4)","v":-25.576157026886854},null,{"$f":"Q9","v":1},-36.643218147720113,-34.21248349908754,-31.779565166176525,-29.34619572121483,-26.912905254203991,-24.479702351365582,-22.047709219538206,-19.617038148802564,-17.18839969076436,-14.762517345997457,-12.339569494493974,-9.9202077695142332,-7.5061055510005534,{"$f":"HLOOKUP($BR$28,AH6:AT27,4)","v":-24.479702351365582}]
[null,{"$f":"'Lookup Tables'!B7","v":"Rear Hub Hole Pos."},null,null,null,null,"Centre",null,{"$f":"'Lookup Tables'!B13","v":"Upper Wishbones"},null,null,null,null,69.5,null,null,1.5,-38.364430963199489,-35.694606971804426,-33.038841991852976,-30.396293484161614,-27.766030006425208,-25.146818312815068,-22.538132127653718,-19.939038167886334,-17.349352555209975,-14.768290585814649,-12.196112033621564,-9.6334615568633382,-7.0825462812107816,{"$f":"HLOOKUP($BR$28,R6:AD27,5)","v":-25.146818312815068},null,1.5,-36.461537998733405,-34.006863778225679,-31.553264777283285,-29.101133440329161,-26.651152498280396,-24.203773728694372,-21.759243215367945,-19.318095675399977,-16.880755083018723,-14.447607656336746,-12.01978976156847,-9.5980355232853345,-7.1841346165244753,{"$f":"HLOOKUP($BR$28,AH6:AT27,5)","v":-24.203773728694372}]
[null,{"$f":"'Lookup Tables'!B8","v":"Rear Track"},null,null,null,null,"Wide",null,{"$f":"'Lookup Tables'!B14","v":"Tyres"},null,null,null,null,"Minispike",null,null,2,-37.980538543032814,-35.299661646568886,-32.634347745585714,-29.983667984592739,-27.346265001105767,-24.721266722634194,-22.107774563492558,-19.504989709656865,-16.912912839833979,-14.331229426140633,-11.760424110418629,-9.2019400182567406,-6.6600961637109481,{"$f":"HLOOKUP($BR$28,R6:AD27,6)","v":-24.721266722634194},null,2,-36.275826446625409,-33.798347187948067,-31.324615913953163,-28.854717722689838,-26.3890389254605,-23.927946381681043,-21.471724197736631,-19.02085750850831,-16.575384865209461,-14.136379568417029,-11.704731446284587,-9.2819857021299743,-6.8709532224340935,{"$f":"HLOOKUP($BR$28,AH6:AT27,6)","v":-23.927946381681043}]
[null,null,null,null,null,null,null,null,null,null,null,null,null,null,null,null,2.5,-37.597278059132265,-34.906077235064558,-32.231910194002083,-29.573196484079968,-26.929397097703152,-24.299096718136692,-21.681502165446553,-19.076145340824592,-16.482948923644344,-13.901703016547994,-11.333779431458803,-8.7821015116246617,-6.2525969982841305,{"$f":"HLOOKUP($BR$28,R6:AD27,7)","v":-24.299096718136692},null,2.5,-36.087332090296584,-33.587935884458908,-31.094331002043337,-28.60727986365082,-26.12658704630395,-23.652528831634822,-21.18540519735992,-18.725459913618376,-16.273035992295654,-13.829133765982403,-11.395024155339005,-8.9727235827110814,-6.5666049263302115,{"$f":"HLOOKUP($BR$28,AH6:AT27,7)","v":-23.652528831634822}]
[null,"Specification 2",null,null,null,null,null,null,null,null,null,null,null,null,null,null,3,-37.214748421618673,-34.513687124540603,-31.83097006585551,-29.165372038936976,-26.515602211294414,-23.880697540922803,-21.259818637854984,-18.652699554615712,-16.05920500045475,-13.479742716987008,-10.91662671144322,-8.3734096729413938,-5.8597901150134302,{"$f":"HLOOKUP($BR$28,R6:AD27,8)","v":-23.880697540922803},null,3,-35.896039006644457,-33.375030576467537,-30.862992925274252,-28.359276008455943,-25.864298446461422,-23.377997075743757,-20.900387813445427,-18.432319625691335,-15.973808037882071,-13.525971738046733,-11.090585909374596,-8.6703889323150687,-6.2710135318568021,{"$f":"HLOOKUP($BR$28,AH6:AT27,8)","v":-23.377997075743757}]
[null,{"$f":"B6","v":"Lower Gearbox Housings"},null,null,null,null,"Std",null,{"$f":"I6","v":"Upper Link"},null,null,null,null,39,null,null,3.5,-36.833344633658058,-34.123066286287418,-31.432457993361787,-28.760189362015847,-26.105027461427618,-23.466174766447981,-20.842734038589555,-18.234519680599757,-15.641746026948136,-13.065503484186515,-10.508360658549345,-7.976056719453064,-5.4817882307751997,{"$f":"HLOOKUP($BR$28,R6:AD27,9)","v":-23.466174766447981},null,3.5,-35.702762173955001,-33.161002042712269,-30.630329362689928,-28.11080664777602,-25.602133857740792,-23.104215964658103,-20.617229892788981,-18.141598567827469,-15.677835076846147,-13.227144037369506,-10.79154080453854,-8.3749899922721713,-5.9847535829199989,{"$f":"HLOOKUP($BR$28,AH6:AT27,9)","v":-23.104215964658103}]
[null,{"$f":"B7","v":"Antisquat Spacers"},null,null,null,null,0,null,{"$f":"I7","v":"Upper Link Spacers"},null,null,null,null,6,null,null,4,-36.453186672484726,-33.733716430066266,-31.03579410127622,-28.357542059927283,-25.697726519443165,-23.055554450420356,-20.430304578411658,-17.822121132559907,-15.230942361320508,-12.659109640548815,-10.109633271341517,-7.5903161556526459,-5.1186243087697445,{"$f":"HLOOKUP($BR$28,R6:AD27,10)","v":-23.055554450420356},null,4,-35.507583567543641,-32.945411913337104,-30.397331588246306,-27.862380644925913,-25.340670751769441,-22.831900810174194,-20.336064550994113,-17.853510314947101,-15.385363020436177,-12.93280430924818,-10.498201485797955,-8.0866936353399819,-5.7076758363077866,{"$f":"HLOOKUP($BR$28,AH6:AT27,10)","v":-22.831900810174194}]
{"$rows_left_out":86}
{"sheet":"Lookup Tables","index":4,"n_rows":41,"n_cols":71,"rows_kept":41,"cut":false,"hidden":true,"merged":[]}
[]
[null,"Item","Options"]
[null,"Lower Gearbox Housings","Std"]
[null,"Antisquat Spacers",0,1,2,3,4,5]
[null,"Rear Toe Block",3,4]
[null,"Rear Hubs","-1 deg","Std","+1 deg"]
[null,"Rear Hub Hole Pos.","Inner","Centre","Outer"]
[null,"Rear Track","Std","Wide"]
[null,"Upper Link",34,39,44,49]
[null,"Upper Link Spacers",0,1,2,3,4,5,6,7,8,9,10]
[null,"Upper Ball Stud Spacers",0,1,2,3,4,5,6,7,8,9,10]
[null,"Lower Wishbones","Std"]
[null,"Upper Wishbones",58,58.25,58.5,58.75,59,59.25,59.5,59.75,60,60.25,60.5,60.75,61,61.25,61.5,61.75,62,62.25,62.5,62.75,63,63.25,63.5,63.75,64,64.25,64.5,64.75,65,65.25,65.5,65.75,66,66.25,66.5,66.75,67,67.25,67.5,67.75,68,68.25,68.5,68.75,69,69.25,69.5,69.75,70,70.25,70.5,70.75,71,71.25,71.5,71.75,72,72.25,72.5,72.75,73,73.25,73.5,73.75,74,74.25,74.5,74.75,75]
[null,"Tyres","Minispike"]
[]
{"$rows_left_out":27}
{"sheet":"Stored data","index":5,"n_rows":1104,"n_cols":25,"rows_kept":1104,"cut":false,"hidden":true,"merged":[]}
["Reference","Std03StdCentreWide3420Std69.25Minispike","Std03StdCentreWide3420Std70.25Minispike","Std03StdCentreWide3920Std67.25Minispike","Std03StdCentreWide4420Std65.5Minispike","Std03StdCentreWide4920Std63Minispike","Std03StdCentreWide4440Std65Minispike","Std03StdCentreWide4940Std62.5Minispike","Std03StdCentreWide3440Std69.75Minispike","Std03StdCentreWide3940Std67.5Minispike","Std03StdCentreWide3400Std70.75Minispike","Std03StdCentreWide3900Std68.25Minispike","Std03StdCentreWide4400Std66Minispike","Std03StdCentreWide4900Std63.5Minispike","Std03StdInnerWide4420Std61Minispike","Std03StdInnerWide4920Std58.75Minispike","Std03StdInnerWide3420Std66.25Minispike","Std03StdInnerWide3920Std64Minispike","Std03StdOuterWide3420Std74.25Minispike","Std03StdOuterWide3920Std71.75Minispike","Std03StdOuterWide4420Std69.25Minispike","Std03StdOuterWide4920Std67Minispike","Std03StdCentreWide3920Std67.75Minispike","Std03StdCentreWide3960Std67Minispike","Std03StdCentreWide3460Std69.5Minispike"]
[{"$f":"'Cougar SV Rear Geometry'!B6","v":"Lower Gearbox Housings"},"Std","Std","Std","Std","Std","Std","Std","Std","Std","Std","Std","Std","Std","Std","Std","Std","Std","Std","Std","Std","Std","Std","Std","Std"]
[{"$f":"'Cougar SV Rear Geometry'!B7","v":"Antisquat Spacers"},0,0,0,0,0,0,0,0,0,0,0,0,0,0,0,0,0,0,0,0,0,0,0,0]
[{"$f":"'Cougar SV Rear Geometry'!B8","v":"Rear Toe Block"},3,3,3,3,3,3,3,3,3,3,3,3,3,3,3,3,3,3,3,3,3,3,3,3]
[{"$f":"'Cougar SV Rear Geometry'!B9","v":"Rear Hubs"},"Std","Std","Std","Std","Std","Std","Std","Std","Std","Std","Std","Std","Std","Std","Std","Std","Std","Std","Std","Std","Std","Std","Std","Std"]
[{"$f":"'Cougar SV Rear Geometry'!B10","v":"Rear Hub Hole Pos."},"Centre","Centre","Centre","Centre","Centre","Centre","Centre","Centre","Centre","Centre","Centre","Centre","Centre","Inner","Inner","Inner","Inner","Outer","Outer","Outer","Outer","Centre","Centre","Centre"]
[{"$f":"'Cougar SV Rear Geometry'!B11","v":"Rear Track"},"Wide","Wide","Wide","Wide","Wide","Wide","Wide","Wide","Wide","Wide","Wide","Wide","Wide","Wide","Wide","Wide","Wide","Wide","Wide","Wide","Wide","Wide","Wide","Wide"]
[{"$f":"'Cougar SV Rear Geometry'!I6","v":"Upper Link"},34,34,39,44,49,44,49,34,39,34,39,44,49,44,49,34,39,34,39,44,49,39,39,34]
[{"$f":"'Cougar SV Rear Geometry'!I7","v":"Upper Link Spacers"},2,2,2,2,2,4,4,4,4,0,0,0,0,2,2,2,2,2,2,2,2,2,6,6]
[{"$f":"'Cougar SV Rear Geometry'!I8","v":"Upper Ball Stud Spacers"},0,0,0,0,0,0,0,0,0,0,0,0,0,0,0,0,0,0,0,0,0,0,0,0]
[{"$f":"'Cougar SV Rear Geometry'!I9","v":"Lower Wishbones"},"Std","Std","Std","Std","Std","Std","Std","Std","Std","Std","Std","Std","Std","Std","Std","Std","Std","Std","Std","Std","Std","Std","Std","Std"]
[{"$f":"'Cougar SV Rear Geometry'!I10","v":"Upper Wishbones"},69.25,70.25,67.25,65.5,63,65,62.5,69.75,67.5,70.75,68.25,66,63.5,61,58.75,66.25,64,74.25,71.75,69.25,67,67.75,67,69.5]
[{"$f":"'Cougar SV Rear Geometry'!I11","v":"Tyres"},"Minispike","Minispike","Minispike","Minispike","Minispike","Minispike","Minispike","Minispike","Minispike","Minispike","Minispike","Minispike","Minispike","Minispike","Minispike","Minispike","Minispike","Minispike","Minispike","Minispike","Minispike","Minispike","Minispike","Minispike"]
[null,-30.376103588509817,-31.242855724809377,-28.204380527229105,-26.051847427231031,-23.13095537481265,-30.123471586106565,-27.25512947958013,-35.177137972724445,-32.84768917871726,-27.433386667808833,-24.760031359455596,-22.131007227859488,-19.171383246286833,-22.751486680782662,-19.987709214866456,-28.18807215550121,-25.719390559355826,-34.577421464880139,-31.906961536205653,-29.106509788566424,-26.443388160050013,-28.614635007938045,-36.995188076029962,-39.517312810411298]
[null,-27.986078265455763,-28.802394447602037,-26.011909003657589,-24.061187858124971,-21.379410163645332,-28.074649170462976,-25.459668143517575,-32.657379226142631,-30.551790544306765,-25.058943405613189,-22.600296150515721,-20.183643813201435,-17.448605469468745,-20.955589639302968,-18.399867520367323,-25.970748117591512,-23.699418929120267,-31.851214539303371,-29.433212729454667,-26.890719652815033,-24.480554069084931,-26.400774195270483,-34.613829159883032,-36.883921827068015]
{"$rows_left_out":1089}